免费注册 查看新帖 |

Chinaunix

  平台 论坛 博客 文库
最近访问板块 发新帖
查看: 2398 | 回复: 2

有关GD安装问题。 [复制链接]

论坛徽章:
0
发表于 2007-03-09 11:44 |显示全部楼层
大家好,我在Redhat AS4上安装Bugzilla,安装GD时,出现以下错误,请求大家帮助,谢谢

[root@Server bugzilla]# /usr/bin/perl -MCPAN -e 'install "GD"'


................

Where is libgd installed? [/usr/lib] /usr/lib

Please choose the features that match how libgd was built:
Build JPEG support? [y] y
Build PNG support? [y] y
Build FreeType support? [y] y
Build GIF support? [y] y
Build support for animated GIFs? [y] y
Build XPM support? [y] y

...............


Manifying blib/man3/GD::Polygon.3pm
  /usr/bin/make  -- OK
Running make test
PERL_DL_NONLAZY=1 /usr/bin/perl "-MExtUtils::Command::MM" "-e" "test_harness(0, 'blib/lib', 'blib/arch')" t/*.t
t/GD..........Can't load './blib/arch/auto/GD/GD.so' for module GD: ./blib/arch/auto/GD/GD.so: undefined symbol: gdImageGifAnimAddPtr at /usr/lib/perl5/5.8.5/i386-linux-thread-multi/DynaLoader.pm line 230.
at t/GD.t line 14
Compilation failed in require at t/GD.t line 14.
BEGIN failed--compilation aborted at t/GD.t line 14.
t/GD..........dubious
        Test returned status 255 (wstat 65280, 0xff00)
DIED. FAILED tests 1-12
        Failed 12/12 tests, 0.00% okay
t/Polyline....Can't load '/root/.cpan/build/GD-2.35/blib/arch/auto/GD/GD.so' for module GD: /root/.cpan/build/GD-2.35/blib/arch/auto/GD/GD.so: undefined symbol: gdImageGifAnimAddPtr at /usr/lib/perl5/5.8.5/i386-linux-thread-multi/DynaLoader.pm line 230.
at /root/.cpan/build/GD-2.35/blib/lib/GD/Polyline.pm line 45
Compilation failed in require at /root/.cpan/build/GD-2.35/blib/lib/GD/Polyline.pm line 45.
BEGIN failed--compilation aborted at /root/.cpan/build/GD-2.35/blib/lib/GD/Polyline.pm line 45.
Compilation failed in require at t/Polyline.t line 10.
BEGIN failed--compilation aborted at t/Polyline.t line 10.
t/Polyline....dubious
        Test returned status 255 (wstat 65280, 0xff00)
DIED. FAILED test 1
        Failed 1/1 tests, 0.00% okay
Failed Test  Stat Wstat Total Fail  Failed  List of Failed
-------------------------------------------------------------------------------
t/GD.t        255 65280    12   23 191.67%  1-12
t/Polyline.t  255 65280     1    2 200.00%  1
Failed 2/2 test scripts, 0.00% okay. 13/13 subtests failed, 0.00% okay.
make: *** [test_dynamic] Error 255
  /usr/bin/make test -- NOT OK
Running make install
  make test had returned bad status, won't install without force

[ 本帖最后由 Trotter 于 2007-3-9 11:45 编辑 ]

论坛徽章:
0
发表于 2007-03-09 12:42 |显示全部楼层
楼主应该是安装Perl的GD库支持,

你应该先安装OS的GD库

论坛徽章:
0
发表于 2007-03-09 12:51 |显示全部楼层
谢谢回复,JPEG、PNG、FreeType 、GIF、XPM 相关的GD库都已经安装了。
您需要登录后才可以回帖 登录 | 注册

本版积分规则 发表回复

  

北京盛拓优讯信息技术有限公司. 版权所有 京ICP备16024965号-6 北京市公安局海淀分局网监中心备案编号:11010802020122 niuxiaotong@pcpop.com 17352615567
未成年举报专区
中国互联网协会会员  联系我们:huangweiwei@itpub.net
感谢所有关心和支持过ChinaUnix的朋友们 转载本站内容请注明原作者名及出处

清除 Cookies - ChinaUnix - Archiver - WAP - TOP