- 论坛徽章:
- 0
|
回复 #1 jgj 的帖子
我执行了 make KERNELPATH=/usr/src/linux.2.4.20-8/之后出现很长串这个,我截取了一部分,
if_ath.c:8890: called object is not a function
if_ath.c: In function `ath_rate_setup':
if_ath.c:8929: invalid suffix on integer constant
if_ath.c:8929: warning: null format string
if_ath.c:8929: called object is not a function
if_ath.c:8938: invalid suffix on integer constant
if_ath.c:8938: warning: null format string
if_ath.c:8938: called object is not a function
if_ath.c: In function `ath_setcurmode':
if_ath.c:8979: invalid suffix on integer constant
if_ath.c:8979: warning: null format string
if_ath.c:8979: called object is not a function
if_ath.c: In function `athff_can_aggregate':
if_ath.c:9094: invalid suffix on integer constant
if_ath.c:9094: warning: null format string
if_ath.c:9094: called object is not a function
if_ath.c: In function `ath_printrxbuf':
if_ath.c:9113: invalid suffix on integer constant
if_ath.c:9113: warning: null format string
if_ath.c:9118: called object is not a function
if_ath.c: In function `ath_printtxbuf':
if_ath.c:9126: invalid suffix on integer constant
if_ath.c:9126: warning: null format string
if_ath.c:9131: called object is not a function
if_ath.c: In function `ath_set_mac_address':
if_ath.c:9172: invalid suffix on integer constant
if_ath.c:9172: warning: null format string
if_ath.c:9172: called object is not a function
if_ath.c:9178: invalid suffix on integer constant
if_ath.c:9178: warning: null format string
if_ath.c:9178: called object is not a function
if_ath.c: In function `ath_change_mtu':
if_ath.c:9201: invalid suffix on integer constant
if_ath.c:9201: warning: null format string
if_ath.c:9201: called object is not a function
if_ath.c:9204: invalid suffix on integer constant
if_ath.c:9204: warning: null format string
if_ath.c:9204: called object is not a function
if_ath.c: In function `ath_ioctl_diag':
if_ath.c:9240: invalid suffix on integer constant
if_ath.c:9240: called object is not a function
if_ath.c:9245: invalid suffix on integer constant
if_ath.c:9245: called object is not a function
if_ath.c:9258: invalid suffix on integer constant
if_ath.c:9258: called object is not a function
if_ath.c:9268: `d523fdd3' undeclared (first use in this function)
if_ath.c:9268: called object is not a function
if_ath.c:9274: invalid suffix on integer constant
if_ath.c:9274: called object is not a function
if_ath.c:9276: invalid suffix on integer constant
if_ath.c:9276: called object is not a function
if_ath.c: In function `ath_ioctl':
if_ath.c:9293: `d523fdd3' undeclared (first use in this function)
if_ath.c:9293: called object is not a function
if_ath.c:9305: invalid suffix on integer constant
if_ath.c:9305: called object is not a function
if_ath.c: In function `ath_dynamic_sysctl_register':
if_ath.c:9699: invalid suffix on integer constant
if_ath.c:9699: called object is not a function
if_ath.c:9701: invalid suffix on integer constant
if_ath.c:9701: warning: null format string
if_ath.c:9701: called object is not a function
if_ath.c:9712: invalid suffix on integer constant
if_ath.c:9712: called object is not a function
if_ath.c:9714: invalid suffix on integer constant
if_ath.c:9714: warning: null format string
if_ath.c:9714: called object is not a function
if_ath.c:9743: invalid suffix on integer constant
if_ath.c:9743: warning: null format string
if_ath.c:9743: called object is not a function
if_ath.c:9744: invalid suffix on integer constant
if_ath.c:9744: called object is not a function
if_ath.c:9745: invalid suffix on integer constant
if_ath.c:9745: called object is not a function
if_ath.c: In function `ath_dynamic_sysctl_unregister':
if_ath.c:9763: invalid suffix on integer constant
if_ath.c:9763: called object is not a function
if_ath.c:9767: invalid suffix on integer constant
if_ath.c:9767: called object is not a function
if_ath.c: In function `ath_announce':
if_ath.c:9783: invalid suffix on integer constant
if_ath.c:9783: warning: null format string
if_ath.c:9785: called object is not a function
if_ath.c:9795: invalid suffix on integer constant
if_ath.c:9795: warning: null format string
if_ath.c:9799: called object is not a function
if_ath.c:9801: invalid suffix on integer constant
if_ath.c:9801: warning: null format string
if_ath.c:9802: called object is not a function
if_ath.c:9804: invalid suffix on integer constant
if_ath.c:9804: warning: null format string
if_ath.c:9805: called object is not a function
if_ath.c:9806: invalid suffix on integer constant
if_ath.c:9806: warning: null format string
if_ath.c:9806: called object is not a function
if_ath.c:9811: invalid suffix on integer constant
if_ath.c:9811: warning: null format string
if_ath.c:9813: called object is not a function
if_ath.c:9815: invalid suffix on integer constant
if_ath.c:9815: warning: null format string
if_ath.c:9816: called object is not a function
if_ath.c:9817: invalid suffix on integer constant
if_ath.c:9817: warning: null format string
if_ath.c:9818: called object is not a function
if_ath.c: In function `ath_sysctl_register':
if_ath.c:9898: floating constant exponent has no digits
if_ath.c:9898: called object is not a function
if_ath.c: In function `ath_sysctl_unregister':
if_ath.c:9907: `fe769456' undeclared (first use in this function)
if_ath.c:9907: called object is not a function
if_ath.c: At top level:
if_ath.c:9922: invalid suffix on integer constant
if_ath.c:9922: parse error before numeric constant
if_ath.c:9922: warning: function declaration isn't a prototype
if_ath.c:9924: conflicting types for `ath_rcv_dev_event'
if_ath.c:251: previous declaration of `ath_rcv_dev_event'
if_ath.c: In function `ath_rcv_dev_event':
if_ath.c:9931: invalid suffix on integer constant
/usr/src/linux-2.4.20-8/include/linux/skbuff.h: In function `kunmap_skb_frag':
/usr/src/linux-2.4.20-8/include/linux/skbuff.h:1129: warning: asm operand 1 probably doesn't match constraints
make[3]: *** [if_ath.o] Error 1
make[3]: Leaving directory `/home/holyfalcon/madwifi-0.9.4/ath'
make[2]: *** [_mod_/home/holyfalcon/madwifi-0.9.4/ath] Error 2
make[2]: Leaving directory `/usr/src/linux-2.4.20-8'
make[1]: *** [all] Error 2
make[1]: Leaving directory `/home/holyfalcon/madwifi-0.9.4/ath'
make: *** [modules] Error 1
[root@localhost madwifi-0.9.4]#
为什么到这步就进行不下去了呢?什么原因呢?请帮我解决,谢谢.我的系统是redhat 9.0 神州没50
笔记本 |
|