- 论坛徽章:
- 0
|
- arm-elf-gcc -c -o main.o -g -Wall -Os -Dlinux -D__linux__ -Dunix -D__uClinux__ -DEMBED -I/work/uClinux-Samsung-kenel/lib/libc/include -I/work/uClinux-Samsung-kenel/lib/libm -I/work/uClinux-Samsung-kenel -fno-builtin -nostartfiles -I/work/uClinux-Samsung-kenel/linux-2.4.x/include -DWEBS -DUEMF -DOS="LINUX" -DLINUX -DUSER_MANAGEMENT_SUPPORT -DDIGEST_ACCESS_SUPPORT -DWEBS_SSL_SUPPORT -I/usr/include/openssl -DOPENSSL -I.. main.c
- In file included from main.c:20:
- ../uemf.h:612: warning: ignoring pragma: ;
- ../uemf.h:641: warning: ignoring pragma: ;
- main.c: In function `websLaunchCgiProc':
- main.c:339: warning: variable `fdout' might be clobbered by `longjmp' or `vfork'
- main.c:339: warning: variable `hstdin' might be clobbered by `longjmp' or `vfork'
- main.c:339: warning: variable `hstdout' might be clobbered by `longjmp' or `vfork'
- arm-elf-gcc -Os -Dlinux -D__linux__ -Dunix -D__uClinux__ -DEMBED -I/work/uClinux-Samsung-kenel/lib/libc/include -I/work/uClinux-Samsung-kenel/lib/libm -I/work/uClinux-Samsung-kenel -fno-builtin -nostartfiles -I/work/uClinux-Samsung-kenel/linux-2.4.x/include -Wl,-elf2flt /work/uClinux-Samsung-kenel/lib/libc/crt0.o /usr/lib/libssl.a /usr/lib/libcrypto.a -o webs ../asp.o ../balloc.o ../base64.o ../cgi.o ../default.o ../ejlex.o ../ejparse.o ../form.o ../h.o ../handler.o ../mime.o ../misc.o ../page.o ../ringq.o ../rom.o ../sock.o ../sockGen.o ../websSSL.o ../security.o ../sym.o ../uemf.o ../url.o ../value.o ../md5c.o ../um.o ../umui.o ../websda.o ../emfdb.o ../webrom.o ../webs.o ../websuemf.o main.o -lm -L/work/uClinux-Samsung-kenel/lib/libc/. -L/work/uClinux-Samsung-kenel/lib/libc/lib -L/work/uClinux-Samsung-kenel/lib/libm -L/work/uClinux-Samsung-kenel/lib/libnet -L/work/uClinux-Samsung-kenel/lib/libdes -L/work/uClinux-Samsung-kenel/lib/libpcap -L/work/uClinux-Samsung-kenel/lib/libssl /usr/lib/libssl.a /usr/lib/libcrypto.a -lc -lm
- /opt/uClinux/arm-elf/bin/gld: address 0x1490c0 of webs.elf section .text is not within region flatmem
- collect2: ld returned 1 exit status
- make[3]: *** [webs] Error 1
- make[3]: Leaving directory `/work/uClinux-Samsung-kenel/user/netmate/webserver/LINUX'
- make[2]: *** [all] Error 2
- make[2]: Leaving directory `/work/uClinux-Samsung-kenel/user/netmate'
- make[1]: *** [all] Error 2
- make[1]: Leaving directory `/work/uClinux-Samsung-kenel/user'
- make: *** [user_only] Error 2
复制代码 我在goahead添加了ssl 就是https 功能就出错了
弄了好久才弄到这步 虚心请教!
goahead 2.1.8 版本
openssl 0.9.8zg版本 |
|