免费注册 查看新帖 |

Chinaunix

  平台 论坛 博客 文库
12下一页
最近访问板块 发新帖
查看: 5482 | 回复: 13
打印 上一主题 下一主题

[proxy] Red Hat linux as4上安装socks5?? [复制链接]

论坛徽章:
0
跳转到指定楼层
1 [收藏(0)] [报告]
发表于 2006-02-14 14:44 |只看该作者 |倒序浏览
在Red Hat linux as4上安装socks5有成功的么?我试了下,不成功啊。
请求大家帮忙!谢谢了!

论坛徽章:
0
2 [报告]
发表于 2006-02-17 23:42 |只看该作者
rhel4,socks5安装没问题啊。

论坛徽章:
0
3 [报告]
发表于 2006-02-21 14:58 |只看该作者
不行啊,楼上的大哥,我在AS4上make install的时候报错啊。我./configure的时候加的参数是--prefix=/usr/local/socks5 --with-static,请问楼上的大哥是怎么安装成功的阿 ?谢谢了 !!!!

论坛徽章:
0
4 [报告]
发表于 2006-02-21 23:01 |只看该作者
我没说清楚,我好像用的rpm安装的,需要的话可以发给你

[ 本帖最后由 supertcy 于 2006-2-21 23:03 编辑 ]

论坛徽章:
0
5 [报告]
发表于 2006-02-22 17:08 |只看该作者
恩,好的,谢谢楼上的拉,你发给我看看吧,邮箱是xiaoyibs@gmail.com,非常感谢!

论坛徽章:
0
6 [报告]
发表于 2006-02-22 20:26 |只看该作者
已发

论坛徽章:
0
7 [报告]
发表于 2006-02-27 23:01 |只看该作者
能给我发一份吗?我也要做socks5代理,却总找不到程序!

论坛徽章:
0
8 [报告]
发表于 2006-02-27 23:02 |只看该作者
我的邮箱是haijd.yuyi#gmail.com

论坛徽章:
0
9 [报告]
发表于 2006-03-24 14:33 |只看该作者
源码编译是有问题


/usr/lib/gcc/i386-redhat-linux/3.4.3/include/varargs.h:5:2: #error "Revise your code to use <stdarg.h>."
./commands.c:2096: error: syntax error before "va_dcl"
./commands.c:2097: error: syntax error before '{' token
./commands.c:2104: warning: parameter names (without types) in function declaration
./commands.c:2104: warning: data definition has no type or storage class
./commands.c:2105: error: conflicting types for 'routine'
./commands.c:2100: error: previous declaration of 'routine' was here
./commands.c:2105: error: `ap' undeclared here (not in a function)
./commands.c:2105: error: syntax error before "intrtn_t"
./commands.c:2109: warning: parameter names (without types) in function declaration
./commands.c:2109: warning: data definition has no type or storage class
./commands.c:2110: error: syntax error before "return"
./commands.c:125: warning: 'call' used but never defined
make[2]: *** [commands.o] Error 1
gcc -I. -I../../include -I./../../include  -D__USE_FIXED_PROTOTYPES__  -DHAVE_SETUPTERM  -DSOCKS -DINCLUDE_PROTOTY
PES -DKLUDGELINEMODE  -c ./main.c
gcc -I. -I../../include -I./../../include  -D__USE_FIXED_PROTOTYPES__  -DHAVE_SETUPTERM  -DSOCKS -DINCLUDE_PROTOTY
PES -DKLUDGELINEMODE  -c ./network.c
gcc -I. -I../../include -I./../../include  -D__USE_FIXED_PROTOTYPES__  -DHAVE_SETUPTERM  -DSOCKS -DINCLUDE_PROTOTY
PES -DKLUDGELINEMODE  -c ./ring.c
gcc -I. -I../../include -I./../../include  -D__USE_FIXED_PROTOTYPES__  -DHAVE_SETUPTERM  -DSOCKS -DINCLUDE_PROTOTY
PES -DKLUDGELINEMODE  -c ./sys_bsd.c
gcc -I. -I../../include -I./../../include  -D__USE_FIXED_PROTOTYPES__  -DHAVE_SETUPTERM  -DSOCKS -DINCLUDE_PROTOTY
PES -DKLUDGELINEMODE  -c ./telnet.c
gcc -I. -I../../include -I./../../include  -D__USE_FIXED_PROTOTYPES__  -DHAVE_SETUPTERM  -DSOCKS -DINCLUDE_PROTOTY
PES -DKLUDGELINEMODE  -c ./terminal.c
gcc -I. -I../../include -I./../../include  -D__USE_FIXED_PROTOTYPES__  -DHAVE_SETUPTERM  -DSOCKS -DINCLUDE_PROTOTY
PES -DKLUDGELINEMODE  -c ./tn3270.c
gcc -I. -I../../include -I./../../include  -D__USE_FIXED_PROTOTYPES__  -DHAVE_SETUPTERM  -DSOCKS -DINCLUDE_PROTOTY
PES -DKLUDGELINEMODE  -c ./utilities.c
make[2]: Target `all' not remade because of errors.
make[2]: Leaving directory `/root/soft/socks5-v1.0r11/clients/telnet'
make[1]: *** [all] Error 2
make[1]: Leaving directory `/root/soft/socks5-v1.0r11/clients'
make: *** [clients] Error 2

论坛徽章:
0
10 [报告]
发表于 2006-03-25 12:06 |只看该作者
源码编译安装可能会跟gcc版本有问题,你google下哪个版本合适~~
您需要登录后才可以回帖 登录 | 注册

本版积分规则 发表回复

  

北京盛拓优讯信息技术有限公司. 版权所有 京ICP备16024965号-6 北京市公安局海淀分局网监中心备案编号:11010802020122 niuxiaotong@pcpop.com 17352615567
未成年举报专区
中国互联网协会会员  联系我们:huangweiwei@itpub.net
感谢所有关心和支持过ChinaUnix的朋友们 转载本站内容请注明原作者名及出处

清除 Cookies - ChinaUnix - Archiver - WAP - TOP