免费注册 查看新帖 |

Chinaunix

  平台 论坛 博客 文库
最近访问板块 发新帖
查看: 1213 | 回复: 4
打印 上一主题 下一主题

安装一个tar.gz包, ./configure时出现以下信息请问是什么原因? [复制链接]

论坛徽章:
0
跳转到指定楼层
1 [收藏(0)] [报告]
发表于 2004-03-08 11:55 |只看该作者 |倒序浏览
片段:

checking whether we are cross compiling... no
checking whether -lc should be explicitly linked in... no
checking whether byte ordering is bigendian... no
checking vfork.h usability... no
checking vfork.h presence... no
checking for vfork.h... no
checking for _doprnt... no
checking if docroot is given... no
checking if gcc profiling is selected... no
checking if java include directory given... no
checking if java OS include directory given... no
checking for png_destroy_read_struct in -lpng... no
checking if any authorisation type is given... no
checking for gdome2... no
checking for purify... no
checking if any threading type is given... no

make的时候出现
/usr/bin/ld: cannot find -lX11
collect2: ld returned 1 exit status
make[2]: *** [aaindexextract] Error 1
make[2]: Leaving directory `/abc/soft/EMBOSS-2.8.0/emboss'
make[1]: *** [all-recursive] Error 1
make[1]: Leaving directory `/abc/soft/EMBOSS-2.8.0/emboss'
make: *** [all-recursive] Error 1

请问这是什么原因? 刚学linux,不太懂......

论坛徽章:
0
2 [报告]
发表于 2004-03-08 12:26 |只看该作者

安装一个tar.gz包, ./configure时出现以下信息请问是什么原因?

装了xwindows没有?

论坛徽章:
0
3 [报告]
发表于 2004-03-08 12:27 |只看该作者

安装一个tar.gz包, ./configure时出现以下信息请问是什么原因?

make install:

make[2]: Nothing to be done for `install-exec-am'.
make[2]: Nothing to be done for `install-data-am'.



sh install.sh
Please enter the full path to your kaptain binary
Default is /usr/bin/kaptain

Error: Can't read input file: -version
install.sh: line 48: [: -lt: unary operator expected


[root@linux em]# rpm -ivh kaptain-0.7-1.i386.rpm
error: Failed dependencies:
        libGLcore.so.1 is needed by kaptain-0.7-1
        libqt.so.3 is needed by kaptain-0.7-1
[root@linux em]# rpm -ivh XFree86-driver-nvidia-1.0.3123-2.i686.rpm
warning: XFree86-driver-nvidia-1.0.3123-2.i686.rpm: V3 DSA signature: NOKEY, key ID e01260f1
error: Failed dependencies:
        XFree86-Xserver is needed by XFree86-driver-nvidia-1.0.3123-2
        XFree86-modules >;= 4.0.1 is needed by XFree86-driver-nvidia-1.0.3123-2
        kernel-video-nvidia = 1.0.3123 is needed by XFree86-driver-nvidia-1.0.3123-2
[root@linux em]# rpm -ivh kernel-video-nvidia-1.0.3123-4@2.2.22_6.i686.rpm
warning: kernel-video-nvidia-1.0.3123-4@2.2.22_6.i686.rpm: V3 DSA signature: NOKEY, key ID e01260f1
error: Failed dependencies:
        kernel-up = 2.2.22-6 is needed by kernel-video-nvidia-1.0.3123-4@2.2.22_6

论坛徽章:
0
4 [报告]
发表于 2004-03-08 12:31 |只看该作者

安装一个tar.gz包, ./configure时出现以下信息请问是什么原因?

[quote]原帖由 "platinum"]装了xwindows没有?[/quote 发表:


是Xfree86吗?我就是在X窗口系统的Gnome桌面环境下安装的啊.linux版本为redhat 9

可能安装XFree86的时候少装了什么东西吧?可我就是不知道少了什么.......

论坛徽章:
0
5 [报告]
发表于 2004-03-08 20:50 |只看该作者

安装一个tar.gz包, ./configure时出现以下信息请问是什么原因?

问题已基本解决.好像是少了X的库


make[2]: Nothing to be done for `install-exec-am'.
make[2]: Nothing to be done for `install-data-am'.


sh install.sh
Please enter the full path to your kaptain binary
Default is /usr/bin/kaptain

Error: Can't read input file: -version
install.sh: line 48: [: -lt: unary operator expected


[root@linux em]# rpm -ivh kaptain-0.7-1.i386.rpm
error: Failed dependencies:
        libGLcore.so.1 is needed by kaptain-0.7-1
        libqt.so.3 is needed by kaptain-0.7-1
[root@linux em]# rpm -ivh XFree86-driver-nvidia-1.0.3123-2.i686.rpm
warning: XFree86-driver-nvidia-1.0.3123-2.i686.rpm: V3 DSA signature: NOKEY, key ID e01260f1
error: Failed dependencies:
        XFree86-Xserver is needed by XFree86-driver-nvidia-1.0.3123-2
        XFree86-modules >;= 4.0.1 is needed by XFree86-driver-nvidia-1.0.3123-2
        kernel-video-nvidia = 1.0.3123 is needed by XFree86-driver-nvidia-1.0.3123-2
[root@linux em]# rpm -ivh kernel-video-nvidia-1.0.3123-4@2.2.22_6.i686.rpm
warning: kernel-video-nvidia-1.0.3123-4@2.2.22_6.i686.rpm: V3 DSA signature: NOKEY, key ID e01260f1
error: Failed dependencies:
        kernel-up = 2.2.22-6 is needed by kernel-video-nvidia-1.0.3123-4@2.2.22_6



[root@linux kaptain-0.71]# make
make  all-recursive
make[1]: Entering directory `/abc/soft/em/kaptain/kaptain-0.71'
Making all in doc
make[2]: Entering directory `/abc/soft/em/kaptain/kaptain-0.71/doc'
make[2]: Nothing to be done for `all'.
make[2]: Leaving directory `/abc/soft/em/kaptain/kaptain-0.71/doc'
Making all in examples
make[2]: Entering directory `/abc/soft/em/kaptain/kaptain-0.71/examples'
make[2]: Nothing to be done for `all'.
make[2]: Leaving directory `/abc/soft/em/kaptain/kaptain-0.71/examples'
Making all in kaptain
make[2]: Entering directory `/abc/soft/em/kaptain/kaptain-0.71/kaptain'
make[2]: Nothing to be done for `all'.
make[2]: Leaving directory `/abc/soft/em/kaptain/kaptain-0.71/kaptain'
make[2]: Entering directory `/abc/soft/em/kaptain/kaptain-0.71'
make[2]: Leaving directory `/abc/soft/em/kaptain/kaptain-0.71'
make[1]: Leaving directory `/abc/soft/em/kaptain/kaptain-0.71'
您需要登录后才可以回帖 登录 | 注册

本版积分规则 发表回复

  

北京盛拓优讯信息技术有限公司. 版权所有 京ICP备16024965号-6 北京市公安局海淀分局网监中心备案编号:11010802020122 niuxiaotong@pcpop.com 17352615567
未成年举报专区
中国互联网协会会员  联系我们:huangweiwei@itpub.net
感谢所有关心和支持过ChinaUnix的朋友们 转载本站内容请注明原作者名及出处

清除 Cookies - ChinaUnix - Archiver - WAP - TOP